Target
Leukotriene B4 receptor 1
Ligand
BDBM50001609
Substrate
Meas. Tech.
ChEMBL_99499 (CHEMBL708398)
Ki
0.140000±n/a nM
Citation
 Huang, FCChan, WKWarus, JDMorrissette, MMMoriarty, KJChang, MNTravis, JJMitchell, LSNuss, GWSutherland, CA 4-[2-[Methyl(2-phenethyl)amino]-2-oxoethyl]-8-(phenylmethoxy)-2- naphthalenecarboxylic acid: a high affinity, competitive, orally active leukotriene B4 receptor antagonist. J Med Chem 35:4253-5 (1992)  
Target
Name:
Leukotriene B4 receptor 1
Synonyms:
BLT BLTR Chemoattractant receptor-like 1 GPR16 LTB4-R 1 Leukotriene B4 R1 Leukotriene B4 receptor 1 P2Y purinoceptor 7 | P2Y7
Type:
Enzyme Catalytic Domain
Mol. Mass.:
37582.68
Organism:
Homo sapiens (Human)
Description:
Q15722
Residue:
352
  
Inhibitor
Name:
BDBM50001609
Synonyms:
8-Benzyloxy-4-[(methyl-phenethyl-carbamoyl)-methyl]-naphthalene-2-carboxylic acid CHEMBL328712
Type:
Small organic molecule
Emp. Form.:
C29H27NO4
Mol. Mass.:
453.529
SMILES:
CN(CCc1ccccc1)C(=O)Cc1cc(cc2c(OCc3ccccc3)cccc12)C(O)=O
: