Target
Leukotriene B4 receptor 1
Ligand
BDBM50001612
Substrate
Meas. Tech.
ChEBML_99498
IC50
4700±n/a nM
Citation
 Huang, FCChan, WKWarus, JDMorrissette, MMMoriarty, KJChang, MNTravis, JJMitchell, LSNuss, GWSutherland, CA 4-[2-[Methyl(2-phenethyl)amino]-2-oxoethyl]-8-(phenylmethoxy)-2- naphthalenecarboxylic acid: a high affinity, competitive, orally active leukotriene B4 receptor antagonist. J Med Chem 35:4253-5 (1992)  
Target
Name:
Leukotriene B4 receptor 1
Synonyms:
BLT BLTR Chemoattractant receptor-like 1 GPR16 LTB4-R 1 Leukotriene B4 R1 Leukotriene B4 receptor 1 P2Y purinoceptor 7 | P2Y7
Type:
Enzyme Catalytic Domain
Mol. Mass.:
37582.68
Organism:
Homo sapiens (Human)
Description:
Q15722
Residue:
352
  
Inhibitor
Name:
BDBM50001612
Synonyms:
2-(4-Benzyloxy-cyclohexa-1,3-dienyl)-N-methyl-N-phenethyl-acetamide | CHEMBL137121
Type:
Small organic molecule
Emp. Form.:
C24H27NO2
Mol. Mass.:
361.4767
SMILES:
CN(CCc1ccccc1)C(=O)CC1=CC=C(CC1)OCc1ccccc1
: