Target
Leukotriene B4 receptor 1
Ligand
BDBM50001631
Substrate
Meas. Tech.
ChEBML_99486
IC50
500±n/a nM
Citation
 Labaudinière, RHendel, WTerlain, BCavy, FMarquis, ODereu, N omega-[(4-Phenyl-2-quinolyl)oxy]alkanoic acid derivatives: a new family of potent LTB4 antagonists. J Med Chem 35:4306-14 (1992)  
Target
Name:
Leukotriene B4 receptor 1
Synonyms:
BLT BLTR Chemoattractant receptor-like 1 GPR16 LTB4-R 1 Leukotriene B4 R1 Leukotriene B4 receptor 1 P2Y purinoceptor 7 | P2Y7
Type:
Enzyme Catalytic Domain
Mol. Mass.:
37582.68
Organism:
Homo sapiens (Human)
Description:
Q15722
Residue:
352
  
Inhibitor
Name:
BDBM50001631
Synonyms:
4-Phenyl-2-[5-(1H-tetrazol-5-yl)-pentyloxy]-quinoline | CHEMBL137234
Type:
Small organic molecule
Emp. Form.:
C21H21N5O
Mol. Mass.:
359.4243
SMILES:
C(CCOc1cc(-c2ccccc2)c2ccccc2n1)CCc1nnn[nH]1
: