Target
Leukotriene B4 receptor 1
Ligand
BDBM50001665
Substrate
Meas. Tech.
ChEBML_99487
IC50
30±n/a nM
Citation
 Labaudinière, RDereu, NCavy, FGuillet, MCMarquis, OTerlain, B omega-[(4,6-Diphenyl-2-pyridyl)oxy]alkanoic acid derivatives: a new family of potent and orally active LTB4 antagonists. J Med Chem 35:4315-24 (1992)  
Target
Name:
Leukotriene B4 receptor 1
Synonyms:
BLT BLTR Chemoattractant receptor-like 1 GPR16 LTB4-R 1 Leukotriene B4 R1 Leukotriene B4 receptor 1 P2Y purinoceptor 7 | P2Y7
Type:
Enzyme Catalytic Domain
Mol. Mass.:
37582.68
Organism:
Homo sapiens (Human)
Description:
Q15722
Residue:
352
  
Inhibitor
Name:
BDBM50001665
Synonyms:
6-[6-(4-Fluoro-phenyl)-4-phenyl-pyridin-2-yloxy]-hexanoic acid | CHEMBL137801
Type:
Small organic molecule
Emp. Form.:
C23H22FNO3
Mol. Mass.:
379.4241
SMILES:
OC(=O)CCCCCOc1cc(cc(n1)-c1ccc(F)cc1)-c1ccccc1
: