Target
Leukotriene B4 receptor 1
Ligand
BDBM50001637
Substrate
Meas. Tech.
ChEMBL_99487 (CHEMBL704375)
IC50
2±n/a nM
Citation
 Labaudinière, RDereu, NCavy, FGuillet, MCMarquis, OTerlain, B omega-[(4,6-Diphenyl-2-pyridyl)oxy]alkanoic acid derivatives: a new family of potent and orally active LTB4 antagonists. J Med Chem 35:4315-24 (1992)  
Target
Name:
Leukotriene B4 receptor 1
Synonyms:
BLT BLTR Chemoattractant receptor-like 1 GPR16 LTB4-R 1 Leukotriene B4 R1 Leukotriene B4 receptor 1 P2Y purinoceptor 7 | P2Y7
Type:
Enzyme Catalytic Domain
Mol. Mass.:
37582.68
Organism:
Homo sapiens (Human)
Description:
Q15722
Residue:
352
  
Inhibitor
Name:
BDBM50001637
Synonyms:
6-[4-(3-Methoxy-phenyl)-6-phenyl-pyridin-2-yloxy]-2-methyl-hexanoic acid | CHEMBL137336
Type:
Small organic molecule
Emp. Form.:
C25H27NO4
Mol. Mass.:
405.4862
SMILES:
COc1cccc(c1)-c1cc(OCCCCC(C)C(O)=O)nc(c1)-c1ccccc1
: