Target
Ephrin type-A receptor 2
Ligand
BDBM50240780
Substrate
Meas. Tech.
ChEMBL_1668759 (CHEMBL4018647)
IC50
>10.0±n/a nM
Citation
 Zhu, WChen, HWang, YWang, JPeng, XChen, XGao, YLi, CHe, YAi, JGeng, MZheng, MLiu, H Design, Synthesis, and Pharmacological Evaluation of Novel Multisubstituted Pyridin-3-amine Derivatives as Multitargeted Protein Kinase Inhibitors for the Treatment of Non-Small Cell Lung Cancer. J Med Chem 60:6018-6035 (2017)  
Target
Name:
Ephrin type-A receptor 2
Synonyms:
ECK EPHA2_HUMAN Epithelial cell kinase | Tyrosine-protein kinase receptor ECK
Type:
PROTEIN
Mol. Mass.:
108260.70
Organism:
Homo sapiens (Human)
Description:
ChEMBL_1505248
Residue:
976
  
Inhibitor
Name:
BDBM50240780
Synonyms:
CHEMBL4062877
Type:
Small organic molecule
Emp. Form.:
C27H23FN4O2
Mol. Mass.:
454.4955
SMILES:
Cc1n[nH]c2ccc(cc12)-c1cc(N[C@@H](CO)c2ccccc2)cnc1-c1cc(F)ccc1O
: