Target
D(2) dopamine receptor
Ligand
BDBM50001797
Substrate
Meas. Tech.
ChEBML_58717
IC50
380±n/a nM
Citation
 Perregaard, JAndersen, KHyttel, JSánchez, C Selective, centrally acting serotonin 5-HT2 antagonists. 1. 2- and 6-substituted 1-phenyl-3-(4-piperidinyl)-1H-indoles. J Med Chem 35:4813-22 (1993)  
Target
Name:
D(2) dopamine receptor
Synonyms:
DOPAMINE D2 DOPAMINE D2 Short Dopamine D2 receptor Drd2
Type:
G Protein-Coupled Receptor (GPCR)
Mol. Mass.:
50931.60
Organism:
Rattus norvegicus (rat)
Description:
P61169
Residue:
444
  
Inhibitor
Name:
BDBM50001797
Synonyms:
1-(2-{4-[1-(4-Fluoro-phenyl)-2-methyl-1H-indol-3-yl]-piperidin-1-yl}-ethyl)-imidazolidin-2-one | CHEMBL423024
Type:
Small organic molecule
Emp. Form.:
C25H29FN4O
Mol. Mass.:
420.5224
SMILES:
Cc1c(C2CCN(CCN3CCNC3=O)CC2)c2ccccc2n1-c1ccc(F)cc1
: