Target
Alpha-1A/Alpha-1B/Alpha-1D adrenergic receptor
Ligand
BDBM50001798
Substrate
Meas. Tech.
ChEMBL_33272 (CHEMBL643610)
IC50
39±n/a nM
Citation
 Perregaard, JAndersen, KHyttel, JSánchez, C Selective, centrally acting serotonin 5-HT2 antagonists. 1. 2- and 6-substituted 1-phenyl-3-(4-piperidinyl)-1H-indoles. J Med Chem 35:4813-22 (1993)  
Target
Name:
Alpha-1A/Alpha-1B/Alpha-1D adrenergic receptor
Synonyms:
Adrenergic receptor alpha-1 alpha-1 Adrenergic Receptor
Type:
Mol. Mass.:
Description:
ASSAY_ID of EBI is 303470
Components:
This complex has 3 components.
Component 1
Name:
Alpha-1B adrenergic receptor
Synonyms:
ADA1B_RAT Alpha 1B-adrenoceptor Alpha adrenergic receptor 1A and 1B Alpha-1Adrenoceptor Alpha-1B adrenoreceptor | adrenergic Alpha1B
Type:
G Protein-Coupled Receptor (GPCR)
Mol. Mass.:
56606.71
Organism:
Rattus norvegicus (rat)
Description:
Receptor binding assays were performed using rat cortical membranes.
Residue:
515
  
Component 2
Name:
Alpha-1A adrenergic receptor
Synonyms:
ADA1A_RAT Adra1c Alpha-1A adrenoceptor Alpha-1C adrenergic receptor | adrenergic Alpha1A
Type:
Protein
Mol. Mass.:
51620.15
Organism:
Rattus norvegicus (Rat)
Description:
P43140
Residue:
466
  
Component 3
Name:
Alpha-1D adrenergic receptor
Synonyms:
ADA1D_RAT Adra1d Alpha-1D adrenergic receptor | Serotonin 1a (5-HT1a) receptor/Adrenergic receptor alpha-1
Type:
Protein
Mol. Mass.:
59375.97
Organism:
Rattus norvegicus (Rat)
Description:
P23944
Residue:
561
  
Inhibitor
Name:
BDBM50001798
Synonyms:
1-{2-[4-(6-Chloro-1-phenyl-1H-indol-3-yl)-piperidin-1-yl]-ethyl}-3-isopropyl-imidazolidin-2-one | CHEMBL145763
Type:
Small organic molecule
Emp. Form.:
C27H33ClN4O
Mol. Mass.:
465.03
SMILES:
CC(C)N1CCN(CCN2CCC(CC2)c2cn(-c3ccccc3)c3cc(Cl)ccc23)C1=O
: