Target
Alpha-1A adrenergic receptor
Ligand
BDBM50001802
Substrate
Meas. Tech.
ChEBML_33271
IC50
6.3±n/a nM
Citation
 Andersen, KPerregaard, JArnt, JNielsen, JBBegtrup, M Selective, centrally acting serotonin 5-HT2 antagonists. 2. Substituted 3-(4-fluorophenyl)-1H-indoles. J Med Chem 35:4823-31 (1993)  
Target
Name:
Alpha-1A adrenergic receptor
Synonyms:
ADA1A_RAT Adra1c Alpha-1A adrenoceptor Alpha-1C adrenergic receptor | adrenergic Alpha1A
Type:
Protein
Mol. Mass.:
51620.15
Organism:
Rattus norvegicus (Rat)
Description:
P43140
Residue:
466
  
Inhibitor
Name:
BDBM50001802
Synonyms:
1-(2-{4-[3-(4-Fluoro-phenyl)-indol-1-yl]-piperidin-1-yl}-ethyl)-imidazolidin-2-one | CHEMBL359031
Type:
Small organic molecule
Emp. Form.:
C24H27FN4O
Mol. Mass.:
406.4958
SMILES:
Fc1ccc(cc1)-c1cn(C2CCN(CCN3CCNC3=O)CC2)c2ccccc12
: