Target
D(2) dopamine receptor
Ligand
BDBM50001813
Substrate
Meas. Tech.
ChEBML_61406
IC50
1200±n/a nM
Citation
 Andersen, KPerregaard, JArnt, JNielsen, JBBegtrup, M Selective, centrally acting serotonin 5-HT2 antagonists. 2. Substituted 3-(4-fluorophenyl)-1H-indoles. J Med Chem 35:4823-31 (1993)  
Target
Name:
D(2) dopamine receptor
Synonyms:
DOPAMINE D2 DOPAMINE D2 Short Dopamine D2 receptor Drd2
Type:
G Protein-Coupled Receptor (GPCR)
Mol. Mass.:
50931.60
Organism:
Rattus norvegicus (rat)
Description:
P61169
Residue:
444
  
Inhibitor
Name:
BDBM50001813
Synonyms:
1-(2-{4-[3-(4-Fluoro-phenyl)-5-methyl-indol-1-yl]-piperidin-1-yl}-ethyl)-1,3-dimethyl-urea | CHEMBL356799
Type:
Small organic molecule
Emp. Form.:
C25H31FN4O
Mol. Mass.:
422.5382
SMILES:
CNC(=O)N(C)CCN1CCC(CC1)n1cc(-c2ccc(F)cc2)c2cc(C)ccc12
: