Target
D(2) dopamine receptor
Ligand
BDBM50001804
Substrate
Meas. Tech.
ChEBML_61406
IC50
200±n/a nM
Citation
 Andersen, KPerregaard, JArnt, JNielsen, JBBegtrup, M Selective, centrally acting serotonin 5-HT2 antagonists. 2. Substituted 3-(4-fluorophenyl)-1H-indoles. J Med Chem 35:4823-31 (1993)  
Target
Name:
D(2) dopamine receptor
Synonyms:
DOPAMINE D2 DOPAMINE D2 Short Dopamine D2 receptor Drd2
Type:
G Protein-Coupled Receptor (GPCR)
Mol. Mass.:
50931.60
Organism:
Rattus norvegicus (rat)
Description:
P61169
Residue:
444
  
Inhibitor
Name:
BDBM50001804
Synonyms:
1-(2-{4-[3-(4-Fluoro-phenyl)-4-methyl-indol-1-yl]-piperidin-1-yl}-ethyl)-imidazolidin-2-one | CHEMBL342730
Type:
Small organic molecule
Emp. Form.:
C25H29FN4O
Mol. Mass.:
420.5224
SMILES:
Cc1cccc2n(cc(-c3ccc(F)cc3)c12)C1CCN(CCN2CCNC2=O)CC1
: