Target
Delta-type opioid receptor
Ligand
BDBM50001850
Substrate
Meas. Tech.
ChEBML_146581
IC50
4±n/a nM
Citation
 Chandrakumar, NSYonan, PKStapelfeld, ASavage, MRorbacher, EContreras, PCHammond, D Preparation and opioid activity of analogues of the analgesic dipeptide 2,6-dimethyl-L-tyrosyl-N-(3-phenylpropyl)-D-alaninamide. J Med Chem 35:223-33 (1992)  
Target
Name:
Delta-type opioid receptor
Synonyms:
Cytochrome P450 3A4 Delta opioid receptor Delta-type opioid receptor (DOR) OPRD_RAT Opioid receptor Opioid receptors; mu & delta Ror-a | Voltage-gated potassium channel
Type:
G Protein-Coupled Receptor (GPCR)
Mol. Mass.:
40465.04
Organism:
Rattus norvegicus (rat)
Description:
Competition binding assays were using CHO-K1 cell membranes expressing the opioid receptor.
Residue:
372
  
Inhibitor
Name:
BDBM50001850
Synonyms:
(S)-2-Amino-3-(4-hydroxy-2,6-dimethyl-phenyl)-N-[(R)-1-(3-phenyl-propylcarbamoyl)-ethyl]-propionamide CHEMBL311145
Type:
Small organic molecule
Emp. Form.:
C23H31N3O3
Mol. Mass.:
397.5105
SMILES:
C[C@@H](NC(=O)[C@@H](N)Cc1c(C)cc(O)cc1C)C(=O)NCCCc1ccccc1
: