Target
Mu-type opioid receptor
Ligand
BDBM50001847
Substrate
Meas. Tech.
ChEBML_146420
IC50
33±n/a nM
Citation
 Chandrakumar, NSYonan, PKStapelfeld, ASavage, MRorbacher, EContreras, PCHammond, D Preparation and opioid activity of analogues of the analgesic dipeptide 2,6-dimethyl-L-tyrosyl-N-(3-phenylpropyl)-D-alaninamide. J Med Chem 35:223-33 (1992)  
Target
Name:
Mu-type opioid receptor
Synonyms:
MOR-1 Mu-type opioid receptor (MOR) OPRM_RAT Opioid receptor B Ror-b
Type:
G Protein-Coupled Receptor (GPCR)
Mol. Mass.:
44503.11
Organism:
Rattus norvegicus (rat)
Description:
Competition binding assays were carried out using membrane preparations from transfected HN9.10 cells that constitutively expressed the mu opioid receptor.
Residue:
398
  
Inhibitor
Name:
BDBM50001847
Synonyms:
2-Amino-N-[2-tert-butoxy-1-(3-phenyl-propoxymethyl)-ethyl]-3-(4-hydroxy-2,6-dimethyl-phenyl)-propionamide | CHEMBL420562
Type:
Small organic molecule
Emp. Form.:
C27H40N2O4
Mol. Mass.:
456.6175
SMILES:
Cc1cc(O)cc(C)c1CC(N)C(=O)N[C@@H](COCCCc1ccccc1)COC(C)(C)C
: