Target
Kappa-type opioid receptor
Ligand
BDBM50001845
Substrate
Meas. Tech.
ChEBML_145373
IC50
5900±n/a nM
Citation
 Chandrakumar, NSYonan, PKStapelfeld, ASavage, MRorbacher, EContreras, PCHammond, D Preparation and opioid activity of analogues of the analgesic dipeptide 2,6-dimethyl-L-tyrosyl-N-(3-phenylpropyl)-D-alaninamide. J Med Chem 35:223-33 (1992)  
Target
Name:
Kappa-type opioid receptor
Synonyms:
KOR-1 OPIATE Kappa Opioid receptor Ror-d
Type:
G Protein-Coupled Receptor (GPCR)
Mol. Mass.:
42692.90
Organism:
Rattus norvegicus (rat)
Description:
P34975
Residue:
380
  
Inhibitor
Name:
BDBM50001845
Synonyms:
2-Amino-3-(4-hydroxy-2,6-dimethyl-phenyl)-N-[2-hydroxy-1-(3-phenyl-propoxymethyl)-ethyl]-propionamide | CHEMBL76816
Type:
Small organic molecule
Emp. Form.:
C23H32N2O4
Mol. Mass.:
400.5112
SMILES:
Cc1cc(O)cc(C)c1CC(N)C(=O)N[C@H](CO)COCCCc1ccccc1
: