Target
Beta-2 adrenergic receptor
Ligand
BDBM50001914
Substrate
Meas. Tech.
ChEBML_37833
IC50
3800±n/a nM
Citation
 Phillips, GBMorgan, TKLumma, WCGomez, RPLind, JMLis, RArgentieri, TSullivan, ME Synthesis, cardiac electrophysiology, and beta-blocking activity of novel arylpiperazines with potential as class II/III antiarrhythmic agents. J Med Chem 35:743-50 (1992)  
Target
Name:
Beta-2 adrenergic receptor
Synonyms:
ADRB2 | ADRB2_CANLF
Type:
PROTEIN
Mol. Mass.:
46593.67
Organism:
Canis familiaris
Description:
ChEMBL_56504
Residue:
415
  
Inhibitor
Name:
BDBM50001914
Synonyms:
CHEMBL350432 | N-[4-(3-Chloro-phenyl)-piperazin-2-ylmethyl]-4-methanesulfonylamino-benzamide
Type:
Small organic molecule
Emp. Form.:
C19H23ClN4O3S
Mol. Mass.:
422.929
SMILES:
CS(=O)(=O)Nc1ccc(cc1)C(=O)NCC1CN(CCN1)c1cccc(Cl)c1
: