Target
Beta-1 adrenergic receptor
Ligand
BDBM50001903
Substrate
Meas. Tech.
ChEBML_39159
IC50
14000±n/a nM
Citation
 Phillips, GBMorgan, TKLumma, WCGomez, RPLind, JMLis, RArgentieri, TSullivan, ME Synthesis, cardiac electrophysiology, and beta-blocking activity of novel arylpiperazines with potential as class II/III antiarrhythmic agents. J Med Chem 35:743-50 (1992)  
Target
Name:
Beta-1 adrenergic receptor
Synonyms:
ADRB1 ADRB1_HUMAN Beta-1 adrenoceptor | adrenergic Beta1
Type:
G Protein-Coupled Receptor (GPCR)
Mol. Mass.:
51338.40
Organism:
Homo sapiens (Human)
Description:
P08588
Residue:
477
  
Inhibitor
Name:
BDBM50001903
Synonyms:
1-o-Tolyl-piperazine | CHEMBL9746
Type:
Small organic molecule
Emp. Form.:
C11H16N2
Mol. Mass.:
176.2581
SMILES:
Cc1ccccc1N1CCNCC1
: