Target
Beta-2 adrenergic receptor
Ligand
BDBM50001894
Substrate
Meas. Tech.
ChEBML_37833
IC50
42000±n/a nM
Citation
 Phillips, GBMorgan, TKLumma, WCGomez, RPLind, JMLis, RArgentieri, TSullivan, ME Synthesis, cardiac electrophysiology, and beta-blocking activity of novel arylpiperazines with potential as class II/III antiarrhythmic agents. J Med Chem 35:743-50 (1992)  
Target
Name:
Beta-2 adrenergic receptor
Synonyms:
ADRB2 | ADRB2_CANLF
Type:
PROTEIN
Mol. Mass.:
46593.67
Organism:
Canis familiaris
Description:
ChEMBL_56504
Residue:
415
  
Inhibitor
Name:
BDBM50001894
Synonyms:
CHEMBL351183 | N-{4-[(1-Phenyl-piperazin-2-ylmethyl)-amino]-phenyl}-methanesulfonamide
Type:
Small organic molecule
Emp. Form.:
C18H24N4O2S
Mol. Mass.:
360.474
SMILES:
CS(=O)(=O)Nc1ccc(NCC2CNCCN2c2ccccc2)cc1
: