Target
D(2) dopamine receptor
Ligand
BDBM50001993
Substrate
Meas. Tech.
ChEBML_61411
IC50
2.1±n/a nM
Citation
 Perregaard, JArnt, JBøgesø, KPHyttel, JSánchez, C Noncataleptogenic, centrally acting dopamine D-2 and serotonin 5-HT2 antagonists within a series of 3-substituted 1-(4-fluorophenyl)-1H-indoles. J Med Chem 35:1092-101 (1992)  
Target
Name:
D(2) dopamine receptor
Synonyms:
DOPAMINE D2 DOPAMINE D2 Short Dopamine D2 receptor Drd2
Type:
G Protein-Coupled Receptor (GPCR)
Mol. Mass.:
50931.60
Organism:
Rattus norvegicus (rat)
Description:
P61169
Residue:
444
  
Inhibitor
Name:
BDBM50001993
Synonyms:
1-(4-Fluoro-phenyl)-3-{1-[2-(2-oxo-imidazolidin-1-yl)-ethyl]-1,2,3,6-tetrahydro-pyridin-4-yl}-1H-indole-5-carbonitrile | CHEMBL268970
Type:
Small organic molecule
Emp. Form.:
C25H24FN5O
Mol. Mass.:
429.4894
SMILES:
Fc1ccc(cc1)-n1cc(C2=CCN(CCN3CCNC3=O)CC2)c2cc(ccc12)C#N
: