Target
D(2) dopamine receptor
Ligand
BDBM50001997
Substrate
Meas. Tech.
ChEBML_61411
IC50
1.9±n/a nM
Citation
 Perregaard, JArnt, JBøgesø, KPHyttel, JSánchez, C Noncataleptogenic, centrally acting dopamine D-2 and serotonin 5-HT2 antagonists within a series of 3-substituted 1-(4-fluorophenyl)-1H-indoles. J Med Chem 35:1092-101 (1992)  
Target
Name:
D(2) dopamine receptor
Synonyms:
DOPAMINE D2 DOPAMINE D2 Short Dopamine D2 receptor Drd2
Type:
G Protein-Coupled Receptor (GPCR)
Mol. Mass.:
50931.60
Organism:
Rattus norvegicus (rat)
Description:
P61169
Residue:
444
  
Inhibitor
Name:
BDBM50001997
Synonyms:
1-(2-{4-[1-(4-Fluoro-phenyl)-5-trifluoromethyl-1H-indol-3-yl]-piperidin-1-yl}-ethyl)-imidazolidin-2-one | CHEMBL12910
Type:
Small organic molecule
Emp. Form.:
C25H26F4N4O
Mol. Mass.:
474.4938
SMILES:
Fc1ccc(cc1)-n1cc(C2CCN(CCN3CCNC3=O)CC2)c2cc(ccc12)C(F)(F)F
: