Target
D(2) dopamine receptor
Ligand
BDBM50002014
Substrate
Meas. Tech.
ChEBML_61411
IC50
24±n/a nM
Citation
 Perregaard, JArnt, JBøgesø, KPHyttel, JSánchez, C Noncataleptogenic, centrally acting dopamine D-2 and serotonin 5-HT2 antagonists within a series of 3-substituted 1-(4-fluorophenyl)-1H-indoles. J Med Chem 35:1092-101 (1992)  
Target
Name:
D(2) dopamine receptor
Synonyms:
DOPAMINE D2 DOPAMINE D2 Short Dopamine D2 receptor Drd2
Type:
G Protein-Coupled Receptor (GPCR)
Mol. Mass.:
50931.60
Organism:
Rattus norvegicus (rat)
Description:
P61169
Residue:
444
  
Inhibitor
Name:
BDBM50002014
Synonyms:
1-(2-{4-[1-(4-Fluoro-phenyl)-5-methoxy-1H-indol-3-yl]-piperidin-1-yl}-ethyl)-imidazolidin-2-one | CHEMBL13048
Type:
Small organic molecule
Emp. Form.:
C25H29FN4O2
Mol. Mass.:
436.5218
SMILES:
COc1ccc2n(cc(C3CCN(CCN4CCNC4=O)CC3)c2c1)-c1ccc(F)cc1
: