Target
D(2) dopamine receptor
Ligand
BDBM50002166
Substrate
Meas. Tech.
ChEMBL_58698 (CHEMBL672043)
IC50
100±n/a nM
Citation
 Böttcher, HBarnickel, GHausberg, HHHaase, AFSeyfried, CAEiermann, V Synthesis and dopaminergic activity of some 3-(1,2,3,6-tetrahydro-1-pyridylalkyl)indoles. A novel conformational model to explain structure-activity relationships. J Med Chem 35:4020-6 (1992)  
Target
Name:
D(2) dopamine receptor
Synonyms:
DOPAMINE D2 DOPAMINE D2 Short Dopamine D2 receptor Drd2
Type:
G Protein-Coupled Receptor (GPCR)
Mol. Mass.:
50931.60
Organism:
Rattus norvegicus (rat)
Description:
P61169
Residue:
444
  
Inhibitor
Name:
BDBM50002166
Synonyms:
3-{4-[4-(4-Chloro-phenyl)-3,6-dihydro-2H-pyridin-1-yl]-butyl}-1H-indole | CHEMBL130501
Type:
Small organic molecule
Emp. Form.:
C23H25ClN2
Mol. Mass.:
364.911
SMILES:
Clc1ccc(cc1)C1=CCN(CCCCc2c[nH]c3ccccc23)CC1
: