Target
D(2) dopamine receptor
Ligand
BDBM50002168
Substrate
Meas. Tech.
ChEMBL_62422 (CHEMBL674826)
Ki
41±n/a nM
Citation
 Böttcher, HBarnickel, GHausberg, HHHaase, AFSeyfried, CAEiermann, V Synthesis and dopaminergic activity of some 3-(1,2,3,6-tetrahydro-1-pyridylalkyl)indoles. A novel conformational model to explain structure-activity relationships. J Med Chem 35:4020-6 (1992)  
Target
Name:
D(2) dopamine receptor
Synonyms:
DOPAMINE D2 DOPAMINE D2 Short Dopamine D2 receptor Drd2
Type:
G Protein-Coupled Receptor (GPCR)
Mol. Mass.:
50931.60
Organism:
Rattus norvegicus (rat)
Description:
P61169
Residue:
444
  
Inhibitor
Name:
BDBM50002168
Synonyms:
3-{4-[4-(4-Methoxy-phenyl)-3,6-dihydro-2H-pyridin-1-yl]-butyl}-1H-indole | CHEMBL339954
Type:
Small organic molecule
Emp. Form.:
C24H28N2O
Mol. Mass.:
360.4919
SMILES:
COc1ccc(cc1)C1=CCN(CCCCc2c[nH]c3ccccc23)CC1
: