Target
Delta-type opioid receptor
Ligand
BDBM50002180
Substrate
Meas. Tech.
ChEBML_146596
Ki
1.1±n/a nM
Citation
 Snyder, KRStory, SCHeidt, MEMurray, TFDeLander, GEAldrich, JV Effect of modification of the basic residues of dynorphin A-(1-13) amide on kappa opioid receptor selectivity and opioid activity. J Med Chem 35:4330-3 (1992)  
Target
Name:
Delta-type opioid receptor
Synonyms:
Cytochrome P450 3A4 Delta opioid receptor Delta-type opioid receptor (DOR) OPRD_RAT Opioid receptor Opioid receptors; mu & delta Ror-a | Voltage-gated potassium channel
Type:
G Protein-Coupled Receptor (GPCR)
Mol. Mass.:
40465.04
Organism:
Rattus norvegicus (rat)
Description:
Competition binding assays were using CHO-K1 cell membranes expressing the opioid receptor.
Residue:
372
  
Inhibitor
Name:
BDBM50002180
Synonyms:
CHEMBL263583 | Tyr-Gly-Gly-Phe-Leu-Arg-Lys(Ac)-Ile-Arg-Pro-Lys-Leu-Lys
Type:
Small organic molecule
Emp. Form.:
C77H129N23O15
Mol. Mass.:
1616.9933
SMILES:
CC[C@H](C)[C@H](NC(=O)[C@H](CCCCNC(C)=O)NC(=O)[C@H](CCCNC(N)=N)NC(=O)[C@H](CC(C)C)NC(=O)[C@H](Cc1ccccc1)NC(=O)CNC(=O)CNC(=O)[C@@H](N)Cc1ccc(O)cc1)C(=O)N[C@@H](CCCNC(N)=N)C(=O)N1CCC[C@H]1C(=O)N[C@@H](CCCCN)C(=O)N[C@@H](CC(C)C)C(=O)N[C@@H](CCCCN)C(N)=O
: