Target
Substance-P receptor
Ligand
BDBM50002655
Substrate
Meas. Tech.
ChEMBL_205719 (CHEMBL807965)
IC50
17±n/a nM
Citation
 Lowe, JADrozda, SESnider, RMLongo, KPZorn, SHMorrone, JJackson, ERMcLean, SBryce, DKBordner, J The discovery of (2S,3S)-cis-2-(diphenylmethyl)-N-[(2-methoxyphenyl)methyl]-1- azabicyclo[2.2.2]-octan-3-amine as a novel, nonpeptide substance P antagonisst. J Med Chem 35:2591-600 (1992)  
Target
Name:
Substance-P receptor
Synonyms:
NK-1 receptor NK1 Receptor NK1R_HUMAN Neurokinin-1 (NK-1) SPR TACR1 Tachykinin receptor 1 (NK1) | tachykinin
Type:
G Protein-Coupled Receptor (GPCR)
Mol. Mass.:
46254.43
Organism:
Homo sapiens (Human)
Description:
P25103
Residue:
407
  
Inhibitor
Name:
BDBM50002655
Synonyms:
((2S,3S)-2-Benzhydryl-1-aza-bicyclo[2.2.2]oct-3-yl)-(2-ethyl-benzyl)-amine CHEMBL315435
Type:
Small organic molecule
Emp. Form.:
C29H34N2
Mol. Mass.:
410.5937
SMILES:
CCc1ccccc1CN[C@H]1C2CCN(CC2)[C@H]1C(c1ccccc1)c1ccccc1
: