Target
Thromboxane-A synthase
Ligand
BDBM50002755
Substrate
Meas. Tech.
ChEBML_207658
IC50
2200±n/a nM
Citation
 Ohshima, ETakami, HSato, HObase, HMiki, IIshii, AKarasawa, AKubo, K Non-prostanoid thromboxane A2 receptor antagonists with a dibenzoxepin ring system. 1. J Med Chem 35:3394-402 (1992)  
Target
Name:
Thromboxane-A synthase
Synonyms:
CYP5 Cytochrome P450 5A1 TBXAS1 TXA synthase TXS Thromboxane A2 Synthase (P450 TxA2) Thromboxane prostanoid Thromboxane-A synthase
Type:
Enzyme
Mol. Mass.:
60524.67
Organism:
Homo sapiens (Human)
Description:
P24557
Residue:
533
  
Inhibitor
Name:
BDBM50002755
Synonyms:
11-[2-(Benzenesulfonyl-methyl-amino)-ethylsulfanyl]-6,11-dihydro-dibenzo[b,e]oxepine-2-carboxylic acid | CHEMBL114424
Type:
Small organic molecule
Emp. Form.:
C24H23NO5S2
Mol. Mass.:
469.573
SMILES:
CN(CCSC1c2ccccc2COc2ccc(cc12)C(O)=O)S(=O)(=O)c1ccccc1
: