Target
Thromboxane A2 receptor
Ligand
BDBM50002754
Substrate
Meas. Tech.
ChEBML_209439
Ki
47±n/a nM
Citation
 Ohshima, ETakami, HSato, HObase, HMiki, IIshii, AKarasawa, AKubo, K Non-prostanoid thromboxane A2 receptor antagonists with a dibenzoxepin ring system. 1. J Med Chem 35:3394-402 (1992)  
Target
Name:
Thromboxane A2 receptor
Synonyms:
Prostanoid TP receptor TBXA2R Thromboxane Thromboxane Beta
Type:
Enyzme
Mol. Mass.:
37445.28
Organism:
Homo sapiens (Human)
Description:
P21731
Residue:
343
  
Inhibitor
Name:
BDBM50002754
Synonyms:
11-[2-(Pyridine-3-sulfonylamino)-ethylsulfanyl]-6,11-dihydro-dibenzo[b,e]oxepine-2-carboxylic acid | CHEMBL296720
Type:
Small organic molecule
Emp. Form.:
C22H20N2O5S2
Mol. Mass.:
456.535
SMILES:
OC(=O)c1ccc2OCc3ccccc3C(SCCNS(=O)(=O)c3cccnc3)c2c1
: