Target
Thromboxane A2 receptor
Ligand
BDBM50002756
Substrate
Meas. Tech.
ChEMBL_209575 (CHEMBL879433)
Ki
25±n/a nM
Citation
 Ohshima, ETakami, HSato, HObase, HMiki, IIshii, AKarasawa, AKubo, K Non-prostanoid thromboxane A2 receptor antagonists with a dibenzoxepin ring system. 1. J Med Chem 35:3394-402 (1992)  
Target
Name:
Thromboxane A2 receptor
Synonyms:
Prostanoid TP receptor TBXA2R Thromboxane Thromboxane Beta
Type:
Enyzme
Mol. Mass.:
37445.28
Organism:
Homo sapiens (Human)
Description:
P21731
Residue:
343
  
Inhibitor
Name:
BDBM50002756
Synonyms:
5-(2-Benzenesulfonylamino-ethylsulfanyl)-5H-dibenzo[a,d]cycloheptene-3-carboxylic acid | CHEMBL415239
Type:
Small organic molecule
Emp. Form.:
C24H21NO4S2
Mol. Mass.:
451.558
SMILES:
OC(=O)c1ccc2C=Cc3ccccc3C(SCCNS(=O)(=O)c3ccccc3)c2c1
: