Target
Thromboxane A2 receptor
Ligand
BDBM50002764
Substrate
Meas. Tech.
ChEMBL_209575 (CHEMBL879433)
Ki
14±n/a nM
Citation
 Ohshima, ETakami, HSato, HObase, HMiki, IIshii, AKarasawa, AKubo, K Non-prostanoid thromboxane A2 receptor antagonists with a dibenzoxepin ring system. 1. J Med Chem 35:3394-402 (1992)  
Target
Name:
Thromboxane A2 receptor
Synonyms:
Prostanoid TP receptor TBXA2R Thromboxane Thromboxane Beta
Type:
Enyzme
Mol. Mass.:
37445.28
Organism:
Homo sapiens (Human)
Description:
P21731
Residue:
343
  
Inhibitor
Name:
BDBM50002764
Synonyms:
11-[2-(3-Nitro-benzenesulfonylamino)-ethylsulfanyl]-6,11-dihydro-dibenzo[b,e]oxepine-2-carboxylic acid | CHEMBL326808
Type:
Small organic molecule
Emp. Form.:
C23H20N2O7S2
Mol. Mass.:
500.544
SMILES:
OC(=O)c1ccc2OCc3ccccc3C(SCCNS(=O)(=O)c3cccc(c3)[N+]([O-])=O)c2c1
: