Target
Thromboxane-A synthase
Ligand
BDBM50002767
Substrate
Meas. Tech.
ChEBML_207658
IC50
830±n/a nM
Citation
 Ohshima, ETakami, HSato, HObase, HMiki, IIshii, AKarasawa, AKubo, K Non-prostanoid thromboxane A2 receptor antagonists with a dibenzoxepin ring system. 1. J Med Chem 35:3394-402 (1992)  
Target
Name:
Thromboxane-A synthase
Synonyms:
CYP5 Cytochrome P450 5A1 TBXAS1 TXA synthase TXS Thromboxane A2 Synthase (P450 TxA2) Thromboxane prostanoid Thromboxane-A synthase
Type:
Enzyme
Mol. Mass.:
60524.67
Organism:
Homo sapiens (Human)
Description:
P24557
Residue:
533
  
Inhibitor
Name:
BDBM50002767
Synonyms:
11-[2-(3-Phenyl-ureido)-ethylsulfanyl]-6,11-dihydro-dibenzo[b,e]oxepine-2-carboxylic acid | CHEMBL114751
Type:
Small organic molecule
Emp. Form.:
C24H22N2O4S
Mol. Mass.:
434.507
SMILES:
OC(=O)c1ccc2OCc3ccccc3C(SCCNC(=O)Nc3ccccc3)c2c1
: