Target
Thromboxane A2 receptor
Ligand
BDBM50002777
Substrate
Meas. Tech.
ChEMBL_209575 (CHEMBL879433)
Ki
7.7±n/a nM
Citation
 Ohshima, ETakami, HSato, HObase, HMiki, IIshii, AKarasawa, AKubo, K Non-prostanoid thromboxane A2 receptor antagonists with a dibenzoxepin ring system. 1. J Med Chem 35:3394-402 (1992)  
Target
Name:
Thromboxane A2 receptor
Synonyms:
Prostanoid TP receptor TBXA2R Thromboxane Thromboxane Beta
Type:
Enyzme
Mol. Mass.:
37445.28
Organism:
Homo sapiens (Human)
Description:
P21731
Residue:
343
  
Inhibitor
Name:
BDBM50002777
Synonyms:
11-(2-Benzyloxycarbonylamino-ethylsulfanyl)-6,11-dihydro-dibenzo[b,e]oxepine-2-carboxylic acid | CHEMBL114473
Type:
Small organic molecule
Emp. Form.:
C25H23NO5S
Mol. Mass.:
449.519
SMILES:
OC(=O)c1ccc2OCc3ccccc3C(SCCNC(=O)OCc3ccccc3)c2c1
: