Target
Thromboxane A2 receptor
Ligand
BDBM50002751
Substrate
Meas. Tech.
ChEMBL_209574 (CHEMBL811275)
Ki
6.5±n/a nM
Citation
 Ohshima, ETakami, HSato, HObase, HMiki, IIshii, AKarasawa, AKubo, K Non-prostanoid thromboxane A2 receptor antagonists with a dibenzoxepin ring system. 1. J Med Chem 35:3394-402 (1992)  
Target
Name:
Thromboxane A2 receptor
Synonyms:
Prostanoid TP receptor TBXA2R Thromboxane Thromboxane Beta
Type:
Enyzme
Mol. Mass.:
37445.28
Organism:
Homo sapiens (Human)
Description:
P21731
Residue:
343
  
Inhibitor
Name:
BDBM50002751
Synonyms:
11-[2-(2-Phenyl-ethenesulfonylamino)-ethylsulfanyl]-6,11-dihydro-dibenzo[b,e]oxepine-2-carboxylic acid | CHEMBL324364
Type:
Small organic molecule
Emp. Form.:
C25H23NO5S2
Mol. Mass.:
481.584
SMILES:
OC(=O)c1ccc2OCc3ccccc3C(SCCNS(=O)(=O)\C=C\c3ccccc3)c2c1
: