Target
Thromboxane A2 receptor
Ligand
BDBM50002755
Substrate
Meas. Tech.
ChEMBL_209575 (CHEMBL879433)
Ki
33±n/a nM
Citation
 Ohshima, ETakami, HSato, HObase, HMiki, IIshii, AKarasawa, AKubo, K Non-prostanoid thromboxane A2 receptor antagonists with a dibenzoxepin ring system. 1. J Med Chem 35:3394-402 (1992)  
Target
Name:
Thromboxane A2 receptor
Synonyms:
Prostanoid TP receptor TBXA2R Thromboxane Thromboxane Beta
Type:
Enyzme
Mol. Mass.:
37445.28
Organism:
Homo sapiens (Human)
Description:
P21731
Residue:
343
  
Inhibitor
Name:
BDBM50002755
Synonyms:
11-[2-(Benzenesulfonyl-methyl-amino)-ethylsulfanyl]-6,11-dihydro-dibenzo[b,e]oxepine-2-carboxylic acid | CHEMBL114424
Type:
Small organic molecule
Emp. Form.:
C24H23NO5S2
Mol. Mass.:
469.573
SMILES:
CN(CCSC1c2ccccc2COc2ccc(cc12)C(O)=O)S(=O)(=O)c1ccccc1
: