Target
Thromboxane A2 receptor
Ligand
BDBM50002750
Substrate
Meas. Tech.
ChEBML_209762
Ki
32±n/a nM
Citation
 Ohshima, ETakami, HSato, HMohri, SObase, HMiki, IIshii, AShirakura, SKarasawa, AKubo, K Non-prostanoid thromboxane A2 receptor antagonists with a dibenzoxepin ring system. 2. J Med Chem 35:3402-13 (1992)  
Target
Name:
Thromboxane A2 receptor
Synonyms:
Prostanoid TP receptor TBXA2R Thromboxane Thromboxane Beta
Type:
Enyzme
Mol. Mass.:
37445.28
Organism:
Homo sapiens (Human)
Description:
P21731
Residue:
343
  
Inhibitor
Name:
BDBM50002750
Synonyms:
11-(2-Benzenesulfonylamino-ethylsulfanyl)-6,11-dihydro-dibenzo[b,e]oxepine-2-carboxylic acid | CHEMBL324130
Type:
Small organic molecule
Emp. Form.:
C23H21NO5S2
Mol. Mass.:
455.547
SMILES:
OC(=O)c1ccc2OCc3ccccc3C(SCCNS(=O)(=O)c3ccccc3)c2c1
: