Target
Thromboxane A2 receptor
Ligand
BDBM50002805
Substrate
Meas. Tech.
ChEMBL_209762 (CHEMBL815553)
Ki
63±n/a nM
Citation
 Ohshima, ETakami, HSato, HMohri, SObase, HMiki, IIshii, AShirakura, SKarasawa, AKubo, K Non-prostanoid thromboxane A2 receptor antagonists with a dibenzoxepin ring system. 2. J Med Chem 35:3402-13 (1992)  
Target
Name:
Thromboxane A2 receptor
Synonyms:
Prostanoid TP receptor TBXA2R Thromboxane Thromboxane Beta
Type:
Enyzme
Mol. Mass.:
37445.28
Organism:
Homo sapiens (Human)
Description:
P21731
Residue:
343
  
Inhibitor
Name:
BDBM50002805
Synonyms:
(daltroban){4-[2-(4-Chloro-benzenesulfonylamino)-ethyl]-phenyl}-acetic acid BM-13505 Daltroban | {4-[2-(4-Chloro-benzenesulfonylamino)-ethyl]-phenyl}-acetic acid
Type:
Small organic molecule
Emp. Form.:
C16H16ClNO4S
Mol. Mass.:
353.821
SMILES:
OC(=O)Cc1ccc(CCNS(=O)(=O)c2ccc(Cl)cc2)cc1
: