Target
Thromboxane A2 receptor
Ligand
BDBM50406682
Substrate
Meas. Tech.
ChEBML_209762
Ki
64±n/a nM
Citation
 Ohshima, ETakami, HSato, HMohri, SObase, HMiki, IIshii, AShirakura, SKarasawa, AKubo, K Non-prostanoid thromboxane A2 receptor antagonists with a dibenzoxepin ring system. 2. J Med Chem 35:3402-13 (1992)  
Target
Name:
Thromboxane A2 receptor
Synonyms:
Prostanoid TP receptor TBXA2R Thromboxane Thromboxane Beta
Type:
Enyzme
Mol. Mass.:
37445.28
Organism:
Homo sapiens (Human)
Description:
P21731
Residue:
343
  
Inhibitor
Name:
BDBM50406682
Synonyms:
CHEMBL2111756
Type:
Small organic molecule
Emp. Form.:
C26H22N2O3
Mol. Mass.:
410.4645
SMILES:
Cc1cc2ncn(C\C=C3\c4ccccc4COc4ccc(cc34)C(O)=O)c2cc1C
: