Target
Cathepsin D
Ligand
BDBM50002986
Substrate
Meas. Tech.
ChEBML_44973
IC50
>10000±n/a nM
Citation
 Raddatz, PJonczyk, AMinck, KORippmann, FSchittenhelm, CSchmitges, CJ Renin inhibitors containing new P1-P1' dipeptide mimetics with heterocycles in P1'. J Med Chem 35:3525-36 (1992)  
Target
Name:
Cathepsin D
Synonyms:
CATD_BOVIN | CTSD
Type:
PROTEIN
Mol. Mass.:
42158.92
Organism:
Bos taurus
Description:
ChEMBL_1458606
Residue:
387
  
Inhibitor
Name:
BDBM50002986
Synonyms:
4-Amino-piperidine-1-carboxylic acid 1-{1-[1-cyclohexylmethyl-2-hydroxy-4-(pyridin-2-ylsulfanyl)-butylcarbamoyl]-3-methylsulfanyl-propylcarbamoyl}-2-phenyl-ethyl ester | CHEMBL325822
Type:
Small organic molecule
Emp. Form.:
C36H53N5O5S2
Mol. Mass.:
699.967
SMILES:
CSCCC(NC(=O)[C@H](Cc1ccccc1)OC(=O)N1CCC(N)CC1)C(=O)N[C@@H](CC1CCCCC1)[C@@H](O)CCSc1ccccn1
: