Target
Renin
Ligand
BDBM50002993
Substrate
Meas. Tech.
ChEBML_195788
pH
5.5±n/a
IC50
150±n/a nM
Comments
extracted
Citation
 Raddatz, PJonczyk, AMinck, KORippmann, FSchittenhelm, CSchmitges, CJ Renin inhibitors containing new P1-P1' dipeptide mimetics with heterocycles in P1'. J Med Chem 35:3525-36 (1992)  
Target
Name:
Renin
Synonyms:
Angiotensinogenase RENI_HUMAN
Type:
Enzyme
Mol. Mass.:
45058.99
Organism:
Homo sapiens (Human)
Description:
Residue:
406
  
Inhibitor
Name:
BDBM50002993
Synonyms:
CHEMBL334319 | {1-[1-[1-Cyclohexylmethyl-2-hydroxy-3-(pyridin-2-ylsulfanyl)-propylcarbamoyl]-2-(3H-imidazol-4-yl)-ethylcarbamoyl]-2-phenyl-ethyl}-carbamic acid tert-butyl ester
Type:
Small organic molecule
Emp. Form.:
C35H48N6O5S
Mol. Mass.:
664.858
SMILES:
CC(C)(C)OC(=O)N[C@@H](Cc1ccccc1)C(=O)N[C@@H](Cc1cnc[nH]1)C(=O)NC(CC1CCCCC1)C(O)CSc1ccccn1
: