Target
Pepsin A
Ligand
BDBM50002971
Substrate
Meas. Tech.
ChEMBL_222284 (CHEMBL823045)
IC50
>10000±n/a nM
Citation
 Raddatz, PJonczyk, AMinck, KORippmann, FSchittenhelm, CSchmitges, CJ Renin inhibitors containing new P1-P1' dipeptide mimetics with heterocycles in P1'. J Med Chem 35:3525-36 (1992)  
Target
Name:
Pepsin A
Synonyms:
PEPA_PIG Pepsin | Pepsin A precursor
Type:
Enzyme
Mol. Mass.:
41232.87
Organism:
Porcine
Description:
Residue:
385
  
Inhibitor
Name:
BDBM50002971
Synonyms:
4-Amino-piperidine-1-carboxylic acid 1-{1-[1-cyclohexylmethyl-2-hydroxy-4-(pyridin-2-ylsulfanyl)-butylcarbamoyl]-ethylcarbamoyl}-2-phenyl-ethyl ester | CHEMBL119293
Type:
Small organic molecule
Emp. Form.:
C34H49N5O5S
Mol. Mass.:
639.848
SMILES:
CC(NC(=O)[C@H](Cc1ccccc1)OC(=O)N1CCC(N)CC1)C(=O)N[C@@H](CC1CCCCC1)[C@@H](O)CCSc1ccccn1
: