Target
Renin
Ligand
BDBM50002983
Substrate
Meas. Tech.
ChEBML_195788
pH
5.5±n/a
IC50
130±n/a nM
Comments
extracted
Citation
 Raddatz, PJonczyk, AMinck, KORippmann, FSchittenhelm, CSchmitges, CJ Renin inhibitors containing new P1-P1' dipeptide mimetics with heterocycles in P1'. J Med Chem 35:3525-36 (1992)  
Target
Name:
Renin
Synonyms:
Angiotensinogenase RENI_HUMAN
Type:
Enzyme
Mol. Mass.:
45058.99
Organism:
Homo sapiens (Human)
Description:
Residue:
406
  
Inhibitor
Name:
BDBM50002983
Synonyms:
4-Amino-piperidine-1-carboxylic acid 1-{1-[1-cyclohexylmethyl-2-hydroxy-4-(pyridin-2-ylsulfanyl)-butylcarbamoyl]-3-methyl-butylcarbamoyl}-2-phenyl-ethyl ester | CHEMBL116823
Type:
Small organic molecule
Emp. Form.:
C37H55N5O5S
Mol. Mass.:
681.928
SMILES:
CC(C)CC(NC(=O)[C@H](Cc1ccccc1)OC(=O)N1CCC(N)CC1)C(=O)N[C@@H](CC1CCCCC1)[C@@H](O)CCSc1ccccn1
: