Target
Adenosine receptor A1
Ligand
BDBM50003021
Substrate
Meas. Tech.
ChEMBL_29417 (CHEMBL643389)
Ki
2.7±n/a nM
Citation
 Suzuki, FShimada, JNonaka, HIshii, AShiozaki, SIchikawa, SOno, E 7,8-Dihydro-8-ethyl-2-(3-noradamantyl)-4-propyl-1H-imidazo[2,1-i]purin-5(4H)-one: a potent and water-soluble adenosine A1 antagonist. J Med Chem 35:3578-81 (1992)  
Target
Name:
Adenosine receptor A1
Synonyms:
A1 adenosine receptor ADENOSINE A1 ADENOSINE A1 low Adenosine A1 receptor | Adenosine Receptor A1
Type:
Enzyme Catalytic Domain
Mol. Mass.:
36501.39
Organism:
GUINEA PIG
Description:
ADENOSINE A1 ADORA1 GUINEA PIG::P47745
Residue:
326
  
Inhibitor
Name:
BDBM50003021
Synonyms:
7-Ethyl-2-(hexahydro-2,5-methano-pentalen-3a-yl)-4-propyl-1,4,6,7-tetrahydro-1,3,4,5a,8-pentaaza-as-indacen-5-one | CHEMBL116486
Type:
Small organic molecule
Emp. Form.:
C21H29N5O
Mol. Mass.:
367.4879
SMILES:
CCCn1c2nc(nc2c2N[C@H](CC)Cn2c1=O)C12CC3CC1CC(C2)C3
: