Target
Adenosine receptor A2a/A2b
Ligand
BDBM50003018
Substrate
Meas. Tech.
ChEBML_27631
Ki
2700±n/a nM
Citation
 Suzuki, FShimada, JNonaka, HIshii, AShiozaki, SIchikawa, SOno, E 7,8-Dihydro-8-ethyl-2-(3-noradamantyl)-4-propyl-1H-imidazo[2,1-i]purin-5(4H)-one: a potent and water-soluble adenosine A1 antagonist. J Med Chem 35:3578-81 (1992)  
Target
Name:
Adenosine receptor A2a/A2b
Synonyms:
Adenosine A2 receptor
Type:
Mol. Mass.:
Description:
ASSAY_ID of ChEMBL is 329906
Components:
This complex has 2 components.
Component 1
Name:
Adenosine receptor A2b
Synonyms:
AA2BR_HUMAN ADORA2B Adenosine receptors A2b | Adenosine receptors; A2a & A2b
Type:
G Protein-Coupled Receptor (GPCR)
Mol. Mass.:
36341.22
Organism:
Homo sapiens (Human)
Description:
Residue:
332
  
Component 2
Name:
Adenosine receptor A2a
Synonyms:
A2A adenosine receptor (hA2A) ADENOSINE A2 ADORA2 Adenosine A2A receptor (A2AAR)
Type:
G Protein-Coupled Receptor (GPCR)
Mol. Mass.:
44716.46
Organism:
Homo sapiens (Human)
Description:
P29274
Residue:
412
  
Inhibitor
Name:
BDBM50003018
Synonyms:
8-(3-Oxo-cyclopentyl)-1,3-dipropyl-3,7-dihydro-purine-2,6-dione | CHEMBL84545
Type:
Small organic molecule
Emp. Form.:
C16H22N4O3
Mol. Mass.:
318.3709
SMILES:
CCCn1c2nc([nH]c2c(=O)n(CCC)c1=O)C1CCC(=O)C1
: