Target
Lanosterol synthase
Ligand
BDBM50003032
Substrate
Meas. Tech.
ChEBML_148909
IC50
550±n/a nM
Citation
 Wannamaker, MWWaid, PPVan Sickle, WAMcCarthy, JRWilson, PKSchatzman, GLMoore, WR N-(1-oxododecyl)-4 alpha,10-dimethyl-8-aza-trans-decal-3 beta-ol: a potent competitive inhibitor of 2,3-oxidosqualene cyclase. J Med Chem 35:3581-3 (1992)  
Target
Name:
Lanosterol synthase
Synonyms:
LSS_RAT Osc
Type:
PROTEIN
Mol. Mass.:
83302.12
Organism:
Rattus norvegicus
Description:
ChEMBL_12083
Residue:
733
  
Inhibitor
Name:
BDBM50003032
Synonyms:
(4aS,5S,6S,8aS)-2-Dodecyl-5,8a-dimethyl-decahydro-isoquinolin-6-ol CHEMBL279569
Type:
Small organic molecule
Emp. Form.:
C23H45NO
Mol. Mass.:
351.6095
SMILES:
CCCCCCCCCCCCN1CC[C@H]2[C@H](C)[C@@H](O)CC[C@]2(C)C1
: