Target
Trifunctional purine biosynthetic protein adenosine-3
Ligand
BDBM50003057
Substrate
Meas. Tech.
ChEBML_69922
IC50
>95000±n/a nM
Citation
 Gangjee, APatel, JKisliuk, RLGaumont, Y 5,10-Methylenetetrahydro-5-deazafolic acid and analogues: synthesis and biological activities. J Med Chem 35:3678-85 (1992)  
Target
Name:
Trifunctional purine biosynthetic protein adenosine-3
Synonyms:
GAR transformylase PUR2_MOUSE
Type:
PROTEIN
Mol. Mass.:
107504.27
Organism:
Mus musculus
Description:
ChEMBL_497843
Residue:
1010
  
Inhibitor
Name:
BDBM50003057
Synonyms:
7-Amino-1,2,3-trimethyl-2,8-dihydro-2,5,6,8-tetraaza-cyclopenta[a]naphthalen-9-one | CHEMBL122959
Type:
Small organic molecule
Emp. Form.:
C12H13N5O
Mol. Mass.:
243.2645
SMILES:
Cc1n(C)c(C)c2c1cnc1nc(N)[nH]c(=O)c21
: