Target
Trifunctional purine biosynthetic protein adenosine-3
Ligand
BDBM50003058
Substrate
Meas. Tech.
ChEBML_69922
IC50
>95000±n/a nM
Citation
 Gangjee, APatel, JKisliuk, RLGaumont, Y 5,10-Methylenetetrahydro-5-deazafolic acid and analogues: synthesis and biological activities. J Med Chem 35:3678-85 (1992)  
Target
Name:
Trifunctional purine biosynthetic protein adenosine-3
Synonyms:
GAR transformylase PUR2_MOUSE
Type:
PROTEIN
Mol. Mass.:
107504.27
Organism:
Mus musculus
Description:
ChEMBL_497843
Residue:
1010
  
Inhibitor
Name:
BDBM50003058
Synonyms:
2-[4-(7-Amino-9-oxo-8,9-dihydro-2,5,6,8-tetraaza-cyclopenta[a]naphthalen-2-yl)-benzoylamino]-pentanedioic acid | CHEMBL331208
Type:
Small organic molecule
Emp. Form.:
C21H18N6O6
Mol. Mass.:
450.4042
SMILES:
Nc1nc(O)c2c3cn(cc3cnc2n1)-c1ccc(cc1)C(=O)NC(CCC(O)=O)C(O)=O
: