Target
Gastrin/cholecystokinin type B receptor
Ligand
BDBM50003203
Substrate
Meas. Tech.
ChEBML_47804
IC50
13±n/a nM
Citation
 Tilley, JWDanho, WShiuey, SJKulesha, ISwistok, JMakofske, RMichalewsky, JTriscari, JNelson, DWeatherford, S Analogs of Ac-CCK-7 incorporating dipeptide mimics in place of Met28-Gly29. J Med Chem 35:3774-83 (1992)  
Target
Name:
Gastrin/cholecystokinin type B receptor
Synonyms:
CCKBR GASR_BOVIN
Type:
PROTEIN
Mol. Mass.:
48807.54
Organism:
Bos taurus
Description:
ChEMBL_48437
Residue:
454
  
Inhibitor
Name:
BDBM50003203
Synonyms:
CHEMBL436199 | N-(1-Carbamoyl-2-phenyl-ethyl)-3-{2-[2-{6-[2-carboxyamino-3-(4-sulfo-phenyl)-propionylamino]-hexanoylamino}-3-(1H-indol-3-yl)-propionylamino]-4-methylsulfanyl-butyrylamino}-succinamic acid
Type:
Small organic molecule
Emp. Form.:
C45H56N8O13S2
Mol. Mass.:
981.102
SMILES:
CSCC[C@H](NC(=O)[C@H](Cc1c[nH]c2ccccc12)NC(=O)CCCCCNC(=O)[C@H](Cc1ccc(cc1)S(O)(=O)=O)NC(O)=O)C(=O)N[C@@H](CC(O)=O)C(=O)N[C@@H](Cc1ccccc1)C(N)=O
: