Target
Integrin alpha-IIb/beta-3
Ligand
BDBM50003321
Substrate
Meas. Tech.
ChEBML_70174
Ki
3130±n/a nM
Citation
 Peishoff, CEAli, FEBean, JWCalvo, RD'Ambrosio, CAEggleston, DSHwang, SMKline, TPKoster, PFNichols, A Investigation of conformational specificity at GPIIb/IIIa: evaluation of conformationally constrained RGD peptides. J Med Chem 35:3962-9 (1992)  
Target
Name:
Integrin alpha-IIb/beta-3
Synonyms:
Glycoprotein IIb/IIIa
Type:
Mol. Mass.:
Description:
ASSAY_ID of EBI is 30109
Components:
This complex has 2 components.
Component 1
Name:
Integrin beta-3
Synonyms:
CD_antigen=CD61 GPIIIa ITGB3 Platelet membrane glycoprotein IIIa
Type:
Protein
Mol. Mass.:
87038.91
Organism:
Homo sapiens (Human)
Description:
P05106
Residue:
788
  
Component 2
Name:
Integrin alpha-IIb
Synonyms:
CD_antigen=CD41 GPIIb Glycoprotein IIb ITGA2B Integrin alpha-IIb heavy chain Integrin alpha-IIb light chain, form 2 Integrin alpha-V/beta-3 and alpha-IIb/beta 3 | Platelet membrane glycoprotein IIb
Type:
Protein
Mol. Mass.:
113354.85
Organism:
Homo sapiens (Human)
Description:
P08514
Residue:
1039
  
Inhibitor
Name:
BDBM50003321
Synonyms:
3-{2-[2-(2-Acetylamino-3-mercapto-propionylamino)-5-guanidino-pentanoylamino]-acetylamino}-N-(1-carbamoyl-2-mercapto-2-methyl-propyl)-succinamic acidAc-Cys-Arg-Gly-Asp-D-Pen-NH2) | CHEMBL130189
Type:
Small organic molecule
Emp. Form.:
C22H39N9O8S2
Mol. Mass.:
621.731
SMILES:
CC(=O)N[C@@H](CS)C(=O)N[C@@H](CCCNC(N)=N)C(=O)NCC(=O)N[C@@H](CC(O)=O)C(=O)N[C@H](C(N)=O)C(C)(C)S
: