Target
Integrin alpha-IIb/beta-3
Ligand
BDBM50003317
Substrate
Meas. Tech.
ChEBML_158684
IC50
5260±n/a nM
Citation
 Peishoff, CEAli, FEBean, JWCalvo, RD'Ambrosio, CAEggleston, DSHwang, SMKline, TPKoster, PFNichols, A Investigation of conformational specificity at GPIIb/IIIa: evaluation of conformationally constrained RGD peptides. J Med Chem 35:3962-9 (1992)  
Target
Name:
Integrin alpha-IIb/beta-3
Synonyms:
Glycoprotein IIb/IIIa
Type:
Mol. Mass.:
Description:
ASSAY_ID of EBI is 30109
Components:
This complex has 2 components.
Component 1
Name:
Integrin beta-3
Synonyms:
CD_antigen=CD61 GPIIIa ITGB3 Platelet membrane glycoprotein IIIa
Type:
Protein
Mol. Mass.:
87038.91
Organism:
Homo sapiens (Human)
Description:
P05106
Residue:
788
  
Component 2
Name:
Integrin alpha-IIb
Synonyms:
CD_antigen=CD41 GPIIb Glycoprotein IIb ITGA2B Integrin alpha-IIb heavy chain Integrin alpha-IIb light chain, form 2 Integrin alpha-V/beta-3 and alpha-IIb/beta 3 | Platelet membrane glycoprotein IIb
Type:
Protein
Mol. Mass.:
113354.85
Organism:
Homo sapiens (Human)
Description:
P08514
Residue:
1039
  
Inhibitor
Name:
BDBM50003317
Synonyms:
CHEMBL339832 | [18-(3-Guanidino-propyl)-2,8,11,14,17,20-hexaoxo-1,7,10,13,16,19-hexaaza-tricyclo[19.3.0.0*3,7*]tetracos-12-yl]-acetic acidcyclo(Pro-Arg-Gly-Asp-Gly-D-Pro)
Type:
Small organic molecule
Emp. Form.:
C24H37N9O8
Mol. Mass.:
579.6061
SMILES:
NC(=N)NCCC[C@H]1NC(=O)[C@@H]2CCCN2C(=O)[C@H]2CCCN2C(=O)CNC(=O)[C@@H](CC(O)=O)NC(=O)CNC1=O
: