Target
Integrin alpha-IIb/beta-3
Ligand
BDBM50230131
Substrate
Meas. Tech.
ChEBML_70176
Ki
4±n/a nM
Citation
 Callahan, JFBean, JWBurgess, JLEggleston, DSHwang, SMKopple, KDKoster, PFNichols, APeishoff, CESamanen, JM Design and synthesis of a C7 mimetic for the predicted gamma-turn conformation found in several constrained RGD antagonists. J Med Chem 35:3970-2 (1992)  
Target
Name:
Integrin alpha-IIb/beta-3
Synonyms:
Glycoprotein IIb/IIIa
Type:
Mol. Mass.:
Description:
ASSAY_ID of EBI is 30109
Components:
This complex has 2 components.
Component 1
Name:
Integrin beta-3
Synonyms:
CD_antigen=CD61 GPIIIa ITGB3 Platelet membrane glycoprotein IIIa
Type:
Protein
Mol. Mass.:
87038.91
Organism:
Homo sapiens (Human)
Description:
P05106
Residue:
788
  
Component 2
Name:
Integrin alpha-IIb
Synonyms:
CD_antigen=CD41 GPIIb Glycoprotein IIb ITGA2B Integrin alpha-IIb heavy chain Integrin alpha-IIb light chain, form 2 Integrin alpha-V/beta-3 and alpha-IIb/beta 3 | Platelet membrane glycoprotein IIb
Type:
Protein
Mol. Mass.:
113354.85
Organism:
Homo sapiens (Human)
Description:
P08514
Residue:
1039
  
Inhibitor
Name:
BDBM50230131
Synonyms:
SKF-107260
Type:
Small organic molecule
Emp. Form.:
C26H31N7O6S2
Mol. Mass.:
601.698
SMILES:
[#6]-[#7]-1-[#6@@H](-[#6]-[#6]-[#6]\[#7]=[#6](/[#7])-[#7])-[#6](=O)-[#7]-[#6]-[#6](=O)-[#7]-[#6@@H](-[#6]-[#6](-[#8])=O)-[#6](=O)-[#7]-c2ccccc2-[#16]-[#16]-c2ccccc2-[#6]-1=O
: