Target
5-hydroxytryptamine receptor 1A
Ligand
BDBM50003341
Substrate
Meas. Tech.
ChEBML_1240
IC50
630±n/a nM
Citation
 Wikström, HAndersson, BElebring, TLagerkvist, SHallnemo, GPettersson, IJovall, PASvensson, KEkman, ACarlsson, A 6-Hydroxy-3-n-propyl-2,3,4,5-tetrahydro-1H-3-benzazepine and analogs: new centrally acting 5-HT1A receptor agonists. J Med Chem 35:3984-90 (1992)  
Target
Name:
5-hydroxytryptamine receptor 1A
Synonyms:
5-HT-1A 5-HT1A 5-hydroxytryptamine receptor 1A (5HT1A) 5ht1a Htr1a Serotonin 1a (5-HT1a) receptor/Adrenergic receptor alpha-1 | Serotonin receptor 1A
Type:
G Protein-Coupled Receptor (GPCR)
Mol. Mass.:
46445.29
Organism:
Rattus norvegicus (rat)
Description:
Binding assays were performed using rat hippocampal membranes.
Residue:
422
  
Inhibitor
Name:
BDBM50003341
Synonyms:
3-Ethyl-2,3,4,5-tetrahydro-1H-benzo[d]azepin-6-ol | CHEMBL129249
Type:
Small organic molecule
Emp. Form.:
C12H17NO
Mol. Mass.:
191.2695
SMILES:
CCN1CCc2cccc(O)c2CC1
: