Target
D(2) dopamine receptor
Ligand
BDBM50003344
Substrate
Meas. Tech.
ChEBML_61768
IC50
10000±n/a nM
Citation
 Wikström, HAndersson, BElebring, TLagerkvist, SHallnemo, GPettersson, IJovall, PASvensson, KEkman, ACarlsson, A 6-Hydroxy-3-n-propyl-2,3,4,5-tetrahydro-1H-3-benzazepine and analogs: new centrally acting 5-HT1A receptor agonists. J Med Chem 35:3984-90 (1992)  
Target
Name:
D(2) dopamine receptor
Synonyms:
DOPAMINE D2 DOPAMINE D2 Short Dopamine D2 receptor Drd2
Type:
G Protein-Coupled Receptor (GPCR)
Mol. Mass.:
50931.60
Organism:
Rattus norvegicus (rat)
Description:
P61169
Residue:
444
  
Inhibitor
Name:
BDBM50003344
Synonyms:
3-Propyl-2,3,4,5-tetrahydro-1H-benzo[d]azepin-7-ol | CHEMBL129676
Type:
Small organic molecule
Emp. Form.:
C13H19NO
Mol. Mass.:
205.2961
SMILES:
CCCN1CCc2ccc(O)cc2CC1
: